{"text_format":"1","workbook":"xlsx","n_sheets":11,"sheets":["Instructions","About","Categories","Organisational Readiness Qs","People Readiness Qs","Process Readiness Qs","Technology Readiness Qs","Report","Definitions","Change Readiness Questions","Working"],"not_rendered":{"charts":5,"images":3,"macros":1,"external_links":0,"defined_names":48,"comments":0,"pivot_tables":0},"unopened":[],"bounds":{"document_bytes":16777216,"sheet_cells":100000,"rows_first":2000,"rows_last":500,"rows_between":2000,"halvings":0,"cell_chars":16384,"cell_head_chars":4096},"cells_cut":0,"cells_raw":0,"read":"whole","date_system":"1904"}

{"sheet":"Instructions","index":0,"n_rows":16,"n_cols":2,"rows_kept":16,"cut":false,"hidden":false,"merged":[]}
[]
[]
[]
[]
[]
[null,"The Change Readiness Assessor helps you to objectively assess your readiness and help to ensure that your change will be a success.  "]
[null,"Please enable macros before you start to complete the assessor."]
[]
{"$rows_left_out":9}
{"sheet":"About","index":1,"n_rows":10,"n_cols":2,"rows_kept":10,"cut":false,"hidden":false,"merged":[]}
[]
[]
[]
[]
[]
[null,"Are you about to implement some new ways-of-working into your business and need to be certain that everybody is ready for them? Do you need to ensure that any impact on customers, staff, stakeholders, processes, technology and current levels of service will be minimised during transition to the new ways-of-working?\n\nThe Change Readiness Assessor has been developed to replace individual surveys and create a coordinated assessment of the progress of your project at any time throughout its lifespan.  It identifies priorities and recommends corrective actions to be taken."]
[]
[null,"The Change Readiness Assessor gives you:\n• an overall rating of the readiness of the business to implement this change\n• a detailed rating for the four key areas of organisational readiness, people readiness, process readiness and technology readiness\n• recommended Corrective Actions to effectively increase your readiness for the change\n• options to print or e-mail the report to colleagues\n\nThe overall rating indicates the readiness of the business to implement this change, and to ensure that any impact of the new ways-of-working on customers, staff, stakeholders, processes, technology and current levels of service will be minimised during transition.\n\nThe Assessor holds the results for a single change project and you can revise your rating at any time during a project’s life. It contains a set of questions sub-divided into four key areas:\n• Organisational Readiness : the readiness of the organisation to move to the new ways-of-working, and assurance that senior management are committed to making it happen\n• People Readiness : the readiness of the organisation's people to embrace the new ways-of-working, and assurance that they will be supported during the transition\n• Process Readiness : the readiness of the new ways-of-working (processes and procedures) to be implemented, and assurance that they are sustainable\n• Technology Readiness : the readiness of the new technology (hardware and software) to be deployed, and assurance that the technical environment can accommodate it\n\nThe questions and corrective actions have been devised by Bestoutcome’s project and programme management practitioners based on their extensive experience of both delivering and independently reviewing change projects and programmes."]
{"$rows_left_out":3}
{"sheet":"Categories","index":2,"n_rows":15,"n_cols":4,"rows_kept":15,"cut":false,"hidden":false,"merged":[[1,1,1,2],[2,1,2,2],[3,1,3,2],[11,2,12,2],[11,3,12,3],[5,2,6,2],[5,3,6,3],[13,2,14,2],[13,3,14,3],[7,2,8,2],[7,3,8,3],[9,2,10,2],[9,3,10,3]]}
[]
[null,"Project Name:"]
[null,"Project Description:"]
[null,"Date of Assessment:",null,"2014-04-06T22:01:36"]
[null,"Category","RAG","Corrective Action"]
[null,"Overall",{"$f":"Working!Q2","v":"N"},{"$f":"Working!J2","v":"Not relevant"}]
[null,{"$f":"Definitions!C5","v":"The readiness of the business to implement this change, and to ensure that any impact of the new ways-of-working will be minimised during transition"}]
[null,"Organisational readiness",{"$f":"Working!Q3","v":"N"},{"$f":"Working!J3","v":"Not relevant"}]
{"$rows_left_out":8}
{"sheet":"Organisational Readiness Qs","index":3,"n_rows":11,"n_cols":5,"rows_kept":11,"cut":false,"hidden":false,"merged":[]}
[]
[null,"No.","Question","RAG","Answer"]
[null,1,{"$f":"'Change Readiness Questions'!C2","v":"Do you have an overall vision for change ?"},{"$f":"Working!G16","v":"N"},"Not Relevant"]
[null,2,{"$f":"'Change Readiness Questions'!C3","v":"Is there a proven track record of successful business change ?"},{"$f":"Working!G17","v":"N"},"Not Relevant"]
[null,3,{"$f":"'Change Readiness Questions'!C4","v":"Has the purpose of this change been clearly articulated ?"},{"$f":"Working!G18","v":"N"},"Not Relevant"]
[null,4,{"$f":"'Change Readiness Questions'!C5","v":"Does the sponsor consistently give active support to this change ?"},{"$f":"Working!G19","v":"N"},"Not Relevant"]
[null,5,{"$f":"'Change Readiness Questions'!C6","v":"Is senior management committed to making this change happen ?"},{"$f":"Working!G20","v":"N"},"Not Relevant"]
[null,6,{"$f":"'Change Readiness Questions'!C7","v":"Do senior management have sufficient leadership skills ?"},{"$f":"Working!G21","v":"N"},"Not Relevant"]
{"$rows_left_out":4}
{"sheet":"People Readiness Qs","index":4,"n_rows":11,"n_cols":5,"rows_kept":11,"cut":false,"hidden":false,"merged":[]}
[]
[null,"No.","Question","RAG","Answer"]
[null,10,{"$f":"'Change Readiness Questions'!C11","v":"Have the people impacted by the change been actively engaged ?"},{"$f":"Working!G25","v":"N"},"Not Relevant"]
[null,11,{"$f":"'Change Readiness Questions'!C12","v":"Has the impact on the organisational structures been considered ?"},{"$f":"Working!G26","v":"N"},"Not Relevant"]
[null,12,{"$f":"'Change Readiness Questions'!C13","v":"Has the impact on terms & conditions been assessed ?"},{"$f":"Working!G27","v":"N"},"Not Relevant"]
[null,13,{"$f":"'Change Readiness Questions'!C14","v":"Do people have the knowledge and skills to make the change work ?"},{"$f":"Working!G28","v":"N"},"Not Relevant"]
[null,14,{"$f":"'Change Readiness Questions'!C15","v":"Have suitable Change Leaders within the business been appointed ?"},{"$f":"Working!G29","v":"N"},"Not Relevant"]
[null,15,{"$f":"'Change Readiness Questions'!C16","v":"Will business users be able to 'rehearse' the new ways-of-working ?"},{"$f":"Working!G30","v":"N"},"Not Relevant"]
{"$rows_left_out":4}
{"sheet":"Process Readiness Qs","index":5,"n_rows":11,"n_cols":5,"rows_kept":11,"cut":false,"hidden":false,"merged":[]}
[]
[null,"No.","Question","RAG","Answer"]
[null,19,{"$f":"'Change Readiness Questions'!C20","v":"Have the designs of the new processes been approved ?"},{"$f":"Working!G34","v":"N"},"Not Relevant"]
[null,20,{"$f":"'Change Readiness Questions'!C21","v":"Have the new processes and procedures been sufficiently tested ?"},{"$f":"Working!G35","v":"N"},"Not Relevant"]
[null,21,{"$f":"'Change Readiness Questions'!C22","v":"Have business users received targeted communications ?"},{"$f":"Working!G36","v":"N"},"Not Relevant"]
[null,22,{"$f":"'Change Readiness Questions'!C23","v":"Are the risks of integrating the new processes being managed ?"},{"$f":"Working!G37","v":"N"},"Not Relevant"]
[null,23,{"$f":"'Change Readiness Questions'!C24","v":"Have business experts approved the transition approach ?"},{"$f":"Working!G38","v":"N"},"Not Relevant"]
[null,24,{"$f":"'Change Readiness Questions'!C25","v":"Has knowledge transfer to the process support staff occurred ?"},{"$f":"Working!G39","v":"N"},"Not Relevant"]
{"$rows_left_out":4}
{"sheet":"Technology Readiness Qs","index":6,"n_rows":11,"n_cols":5,"rows_kept":11,"cut":false,"hidden":false,"merged":[]}
[]
[null,"No.","Question","RAG","Answer"]
[null,28,{"$f":"'Change Readiness Questions'!C29","v":"Has the design of the new technology been approved by IM?"},{"$f":"Working!G43","v":"N"},"Not Relevant"]
[null,29,{"$f":"'Change Readiness Questions'!C30","v":"Has the new technology been sufficiently tested functionally ?"},{"$f":"Working!G44","v":"N"},"Not Relevant"]
[null,30,{"$f":"'Change Readiness Questions'!C31","v":"Has the new technology been sufficiently tested for capacity and resilience in everyday use?"},{"$f":"Working!G45","v":"N"},"Not Relevant"]
[null,31,{"$f":"'Change Readiness Questions'!C32","v":"Are the risks of deploying the new technology being managed ?"},{"$f":"Working!G46","v":"N"},"Not Relevant"]
[null,32,{"$f":"'Change Readiness Questions'!C33","v":"Have technical experts approved the transition approach ?"},{"$f":"Working!G47","v":"N"},"Not Relevant"]
[null,33,{"$f":"'Change Readiness Questions'!C34","v":"Have data quality criteria been agreed ?"},{"$f":"Working!G48","v":"N"},"Not Relevant"]
{"$rows_left_out":4}
{"sheet":"Report","index":7,"n_rows":74,"n_cols":6,"rows_kept":74,"cut":false,"hidden":false,"merged":[[7,3,7,4],[43,0,43,2],[43,3,43,5],[8,3,8,4],[9,3,9,4],[13,3,13,5],[15,0,15,2],[14,0,14,2],[36,0,36,2],[36,3,36,5],[38,0,38,2],[38,3,38,5],[28,0,28,2],[26,3,26,5],[28,3,28,5],[26,0,26,2],[37,0,37,2],[32,0,32,2],[34,3,34,5],[37,3,37,5],[15,3,15,5],[30,3,30,5],[25,0,25,2],[16,0,16,2],[19,3,19,5],[21,0,21,2],[21,3,21,5],[27,0,27,2],[11,3,11,5],[42,0,42,2],[42,3,42,5],[32,3,32,5],[14,3,14,5],[16,3,16,5],[24,3,24,5],[25,3,25,5],[35,3,35,5],[23,3,23,5],[17,3,17,5],[30,0,30,2],[27,3,27,5],[29,0,29,2],[29,3,29,5],[18,3,18,5],[20,3,20,5],[22,3,22,5],[41,3,41,5],[8,0,8,1],[9,0,9,1],[24,0,24,2],[17,0,17,2],[12,0,12,1],[18,0,18,2],[11,0,11,2],[13,0,13,2],[20,0,20,2],[23,0,23,2],[22,0,22,2],[19,0,19,2],[72,4,72,5],[73,4,73,5],[53,0,53,2],[7,0,7,1],[64,4,64,5],[65,4,65,5],[66,4,66,5],[67,4,67,5],[68,4,68,5],[72,1,72,2],[73,1,73,2],[56,4,56,5],[57,4,57,5],[58,4,58,5],[59,4,59,5],[60,4,60,5],[61,4,61,5],[62,4,62,5],[63,4,63,5],[69,1,69,2],[57,1,57,2],[58,1,58,2],[70,4,70,5],[69,4,69,5],[44,3,44,5],[59,1,59,2],[49,3,49,5],[46,0,46,2],[46,3,46,5],[39,3,39,5],[45,3,45,5],[50,0,50,2],[48,0,48,2],[48,3,48,5],[56,1,56,2],[40,3,40,5],[47,0,47,2],[68,1,68,2],[61,1,61,2],[62,1,62,2],[63,1,63,2],[64,1,64,2],[65,1,65,2],[66,1,66,2],[67,1,67,2],[71,4,71,5],[70,1,70,2],[71,1,71,2],[60,1,60,2],[45,0,45,2],[34,0,34,2],[44,0,44,2],[41,0,41,2],[39,0,39,2],[0,0,0,5],[1,1,1,5],[51,0,51,2],[51,3,51,5],[40,0,40,2],[47,3,47,5],[49,0,49,2],[2,2,2,5],[2,0,4,1],[6,2,6,5],[6,0,6,1],[3,2,3,5],[4,2,4,5],[5,2,5,5],[5,0,5,1],[33,0,33,1],[35,0,35,2],[50,3,50,5]]}
[{"$f":"CONCATENATE(\"Project Name: \",IF(ProjectName=0,\"Not yet provided\",ProjectName))","v":"Project Name: Not yet provided"}]
[null,{"$f":"IF(ProjectDesc=0,\"\",ProjectDesc)","v":""}]
[null,null,"Top 3 recommended corrective actions for your project:"]
[null,null,{"$f":"CONCATENATE(\"1. \",IF(ISERROR(VLOOKUP(1,Working!E$16:G$51,2,FALSE)),\"\",VLOOKUP(1,Working!E$16:G$51,2,FALSE)))","v":"1. "}]
[null,null,{"$f":"CONCATENATE(\"2. \",IF(ISERROR(VLOOKUP(2,Working!E$16:G$51,2,FALSE)),\"\",VLOOKUP(2,Working!E$16:G$51,2,FALSE)))","v":"2. "}]
["Overall Readiness",null,{"$f":"CONCATENATE(\"3. \",IF(ISERROR(VLOOKUP(3,Working!E$16:G$51,2,FALSE)),\"\",VLOOKUP(3,Working!E$16:G$51,2,FALSE)))","v":"3. "}]
[{"$f":"Categories!D6","v":"Not relevant"},null,"Corrective actions continued on page 3"]
["Organisational readiness",null,"People readiness","Process readiness",null,"Technology readiness"]
{"$rows_left_out":67}
{"sheet":"Definitions","index":8,"n_rows":9,"n_cols":7,"rows_kept":9,"cut":false,"hidden":true,"merged":[]}
[]
[null,"Change Readiness Assessor Tool",null,null,"Last updated :","2013-03-30"]
[]
[null,"Category","Description",null,"Red","Amber","Green"]
[null,"Overall","The readiness of the business to implement this change, and to ensure that any impact of the new ways-of-working will be minimised during transition",null,"The business is not ready for the change, and should not implement the new ways-of-working unless substantial corrective action is taken","The business is getting ready for the change, but should complete some key corrective actions before implementing the new ways-of-working","The business is ready to implement the change, and has prepared thoroughly for a successful transition to the new ways-of-working"]
[null,"Organisational readiness","The readiness of the organisation to move to the new ways-of-working, and assurance that senior management are committed to making it happen",null,"The organisation is not ready for the new ways-of-working. Substantial corrective action should be taken before proceeding","The organisation is getting ready for the new ways-of-working, but key corrective action should be taken before implementing them","The organisation is ready for the new ways-of-working. Senior management are committed to the change and have prepared thoroughly for implementing the new ways-of-working"]
[null,"People readiness","The readiness of the organisation's people to embrace the new ways-of-working, and assurance that they will be supported during the transition",null,"Staff are not ready for the new ways-of-working. Substantial corrective action should be taken before proceeding.","Staff are getting ready for the new ways-of-working, but key corrective action should be taken before implementing them","Staff are ready for the new ways-of-working, and have been actively involved in preparing for their implementation"]
[null,"Process readiness","The readiness of the new processes and procedures to be implemented, and assurance that they are sustainable",null,"The new processes and procedures are not ready to be implemented. Substantial corrective action should be taken before proceeding","The new processes and procedures are becoming ready, but key corrective action should be taken before implementing them","The new processes and procedures are ready to be implemented"]
{"$rows_left_out":2}
{"sheet":"Change Readiness Questions","index":9,"n_rows":38,"n_cols":14,"rows_kept":38,"cut":false,"hidden":true,"merged":[]}
["ID","Category","Question","Actions","Not relevant","Answer - green","Answer - amber","Answer - red","Actions - green","Actions - amber","Actions - red","Hint","Weighting Factor","Non-Null Max Weighting"]
[0,"organisational readiness","Do you have an overall vision for change ?","Create, approve and publish the Vision for Change ","Not Relevant","Yes - the Vision for Change is available to all ","The Vision for Change is known to senior executives only","No - a Vision for Change does not exist","n/a","Review the Vision for Change and communicate it to customers and stakeholders","Create, approve and publish the Vision for Change ",null,1,{"$f":"IF('Organisational Readiness Qs'!D3=\"N\",0,2*'Change Readiness Questions'!M2)","v":0}]
[1,"organisational readiness","Is there a proven track record of successful business change ?","Engage some experienced and successful change delivery managers","Not Relevant","Yes - the organisation has often undertaken business change successfully","Previous business change initiatives produced inconsistent outcomes","No - previous business change initiatives have been largely unsuccessful","n/a","Provide mentoring from experienced and successful change delivery managers to staff","Engage some experienced and successful change delivery managers to deliver the change",null,2,{"$f":"IF('Organisational Readiness Qs'!D4=\"N\",0,2*'Change Readiness Questions'!M3)","v":0}]
[2,"organisational readiness","Has the purpose of this change been clearly articulated ?","Create, approve and publish the Vision for Change for this project","Not Relevant","Yes - the purpose of this change has been clearly communicated across the business","The purpose of this change is known but has not yet been communicated","No - the purpose of this change is unknown / ambiguous","n/a","Review the project's Vision for Change and communicate it to the stakeholders","Create, approve and publish the Vision for Change for this project","(e.g. outcomes, benefits, opportunities, value)",3,{"$f":"IF('Organisational Readiness Qs'!D5=\"N\",0,2*'Change Readiness Questions'!M4)","v":0}]
[3,"organisational readiness","Does the sponsor consistently give active support to this change ?","Work closely with the Sponsor to urgently increase their active support for the change","Not Relevant","Yes - the sponsor is actively promoting the change","The sponsor supports the change but participates only at major milestones","No - the sponsor does not support / ignores the change","n/a","Strengthen communications about the Sponsor's support and encourage them to participate at more events","Work closely with the Sponsor to urgently increase their active support for the change",null,4,{"$f":"IF('Organisational Readiness Qs'!D6=\"N\",0,2*'Change Readiness Questions'!M5)","v":0}]
[4,"organisational readiness","Is senior management committed to making this change happen ?","Undertake a communications campaign to engage senior management and gain their active commitment to the change","Not Relevant","Yes - senior management regularly demonstrate active commitment","Senior management show passive commitment to the change","No - senior management show no commitment to the change","n/a","Work with senior management to convert their passive commitment to active support","Initiate a communications campaign to engage senior management and gain their active commitment to the change",null,3,{"$f":"IF('Organisational Readiness Qs'!D7=\"N\",0,2*'Change Readiness Questions'!M6)","v":0}]
[5,"organisational readiness","Do senior management have sufficient leadership skills ?","Engage leadership coaches for senior management","Not Relevant","Yes - all managers have proven leadership and coaching skills","Some managers have leadership and coaching capabilities","No - managers do not have proven leadership skills","n/a","Encourage experienced leaders to provide coaching to less experienced managers","Engage leadership coaches for senior management throughout the change",null,4,{"$f":"IF('Organisational Readiness Qs'!D8=\"N\",0,2*'Change Readiness Questions'!M7)","v":0}]
[6,"organisational readiness","Is there an agreed project plan for delivering this change ?","Create, approve and enact the project plan for delivering the change, including accountabilities","Not Relevant","Yes - the project plan has been approved and is underway","An outline project plan exists, but has not been signed off","No - a project plan does not exist","n/a","Define accountabilities for delivering the change, update the project plan and get sign-off","Create, approve and enact the project plan for delivering the change, including accountabilities",null,3,{"$f":"IF('Organisational Readiness Qs'!D9=\"N\",0,2*'Change Readiness Questions'!M8)","v":0}]
{"$rows_left_out":31}
{"sheet":"Working","index":10,"n_rows":52,"n_cols":17,"rows_kept":52,"cut":false,"hidden":true,"merged":[[2,2,3,2],[4,2,5,2],[6,2,7,2],[8,2,9,2],[2,1,3,1],[4,1,5,1],[6,1,7,1],[8,1,9,1],[1,9,1,15],[6,3,7,3],[8,3,9,3],[11,9,11,10],[2,9,2,15],[4,9,4,15],[6,9,6,15],[8,9,8,15],[2,3,3,3],[4,3,5,3]]}
["Category","RAG","sum products of Qs and Answers","sum of max weighted non-null ",null,"speedo position","speedo width","speedo end","unanswered questions","Corrective action",null,null,null,null,null,null,"RAG"]
["Overall",{"$f":"IF(UnansweredQs=0,IF(ISERROR(INT(100*C2/D2)),\"N\",INT(100*C2/D2)),-1)","v":"N"},{"$f":"SUM(C3:C10)","v":0},{"$f":"SUM(D3:D10)","v":0},{"$f":"A2","v":"Overall"},{"$f":"IF(B2=\"N\",0,IF(B2 < 0,150,B2))","v":0},1,{"$f":"199-F2","v":199},{"$f":"COUNTIF(C16:C51,-1)","v":0},{"$f":"IF(I2=0,IF(B2<=RAG_GREEN,Definitions!G5,IF(B2<=RAG_AMBER,Definitions!F5,IF(B2<=100,Definitions!E5,\"Not relevant\"))),CONCATENATE(36-I2,\" out of 36 questions answered\"))","v":"Not relevant"},null,null,null,null,null,null,{"$f":"IF(B2<0,\"N\",IF(B2<=RAG_GREEN,\"Green\",IF(B2<=RAG_AMBER,\"Amber\",IF(B2=\"N\",\"N\",\"Red\"))))","v":"N"}]
["Organizational readiness",{"$f":"IF(I3=0,IF(ISERROR(INT(100*C3/D3)),\"N\",INT(100*C3/D3)),-1)","v":"N"},{"$f":"SUMPRODUCT(C16:C24,'Change Readiness Questions'!M2:M10)","v":0},{"$f":"SUM('Change Readiness Questions'!N2:N10)","v":0},{"$f":"A3","v":"Organizational readiness"},{"$f":"IF(B3=\"N\",0,IF(B3 < 0,150,B3))","v":0},1,{"$f":"199-F3","v":199},{"$f":"COUNTIF(C16:C24,-1)","v":0},{"$f":"IF(I3=0,IF(B3<=RAG_GREEN,Definitions!G6,IF(B3<=RAG_AMBER,Definitions!F6,IF(B3<=100,Definitions!E6,\"Not relevant\"))),CONCATENATE(9-I3,\" out of 9 questions answered\"))","v":"Not relevant"},null,null,null,null,null,null,{"$f":"IF(B3<0,\"N\",IF(B3<=RAG_GREEN,\"Green\",IF(B3<=RAG_AMBER,\"Amber\",IF(B3=\"N\",\"N\",\"Red\"))))","v":"N"}]
[]
["People readiness",{"$f":"IF(I5=0,IF(ISERROR(INT(100*C5/D5)),\"N\",INT(100*C5/D5)),-1)","v":"N"},{"$f":"SUMPRODUCT(C25:C33,'Change Readiness Questions'!M11:M19)","v":0},{"$f":"SUM('Change Readiness Questions'!N11:N19)","v":0},{"$f":"A5","v":"People readiness"},{"$f":"IF(B5=\"N\",0,IF(B5 < 0,150,B5))","v":0},1,{"$f":"199-F5","v":199},{"$f":"COUNTIF(C25:C33,-1)","v":0},{"$f":"IF(I5=0,IF(B5<=RAG_GREEN,Definitions!G7,IF(B5<=RAG_AMBER,Definitions!F7,IF(B5<=100,Definitions!E7,\"Not relevant\"))),CONCATENATE(9-I5,\" out of 9 questions answered\"))","v":"Not relevant"},null,null,null,null,null,null,{"$f":"IF(B5<0,\"N\",IF(B5<=RAG_GREEN,\"Green\",IF(B5<=RAG_AMBER,\"Amber\",IF(B5=\"N\",\"N\",\"Red\"))))","v":"N"}]
[]
["Process readiness",{"$f":"IF(I7=0,IF(ISERROR(INT(100*C7/D7)),\"N\",INT(100*C7/D7)),-1)","v":"N"},{"$f":"SUMPRODUCT(C34:C42,'Change Readiness Questions'!M20:M28)","v":0},{"$f":"SUM('Change Readiness Questions'!N20:N28)","v":0},{"$f":"A7","v":"Process readiness"},{"$f":"IF(B7=\"N\",0,IF(B7 < 0,150,B7))","v":0},1,{"$f":"199-F7","v":199},{"$f":"COUNTIF(C34:C42,-1)","v":0},{"$f":"IF(I7=0,IF(B7<=RAG_GREEN,Definitions!G8,IF(B7<=RAG_AMBER,Definitions!F8,IF(B7<=100,Definitions!E8,\"Not relevant\"))),CONCATENATE(9-I7,\" out of 9 questions answered\"))","v":"Not relevant"},null,null,null,null,null,null,{"$f":"IF(B7<0,\"N\",IF(B7<=RAG_GREEN,\"Green\",IF(B7<=RAG_AMBER,\"Amber\",IF(B7=\"N\",\"N\",\"Red\"))))","v":"N"}]
[]
{"$rows_left_out":44}